Target
Urease
Ligand
BDBM50452586
Substrate
Meas. Tech.
ChEMBL_1747806 (CHEMBL4182316)
IC50
4200±n/a nM
Citation
 Taha, MUllah, HAl Muqarrabun, LMRKhan, MNRahim, FAhmat, NJavid, MTAli, MKhan, KM Bisindolylmethane thiosemicarbazides as potential inhibitors of urease: Synthesis and molecular modeling studies. Bioorg Med Chem 26:152-160 (2018)  
Target
Name:
Urease
Synonyms:
UREA_CANEN | Urea amidohydrolase
Type:
Enzyme
Mol. Mass.:
90746.20
Organism:
Canavalia ensiformis (Jack bean) (Horse bean)
Description:
P07374
Residue:
840
  
Inhibitor
Name:
BDBM50452586
Synonyms:
CHEMBL4214719
Type:
Small organic molecule
Emp. Form.:
C42H38N8O2S2
Mol. Mass.:
750.934
SMILES:
Cc1ccc(NC(=S)NNC(=O)c2ccc3[nH]cc(C(c4c[nH]c5ccc(cc45)C(=O)NNC(=S)Nc4ccc(C)cc4)c4ccc(C)cc4)c3c2)cc1
: