Target
Urease
Ligand
BDBM50229993
Substrate
Meas. Tech.
ChEMBL_1747806 (CHEMBL4182316)
IC50
21250±n/a nM
Citation
 Taha, MUllah, HAl Muqarrabun, LMRKhan, MNRahim, FAhmat, NJavid, MTAli, MKhan, KM Bisindolylmethane thiosemicarbazides as potential inhibitors of urease: Synthesis and molecular modeling studies. Bioorg Med Chem 26:152-160 (2018)  
Target
Name:
Urease
Synonyms:
UREA_CANEN | Urea amidohydrolase
Type:
Enzyme
Mol. Mass.:
90746.20
Organism:
Canavalia ensiformis (Jack bean) (Horse bean)
Description:
P07374
Residue:
840
  
Inhibitor
Name:
BDBM50229993
Synonyms:
2-thiourea Thiocarbamid Thiokarbamid thiocarbamide thiourea
Type:
Small organic molecule
Emp. Form.:
CH4N2S
Mol. Mass.:
76.121
SMILES:
NC(N)=S
: