Target
Urease
Ligand
BDBM50452593
Substrate
Meas. Tech.
ChEMBL_1747806 (CHEMBL4182316)
IC50
800±n/a nM
Citation
 Taha, MUllah, HAl Muqarrabun, LMRKhan, MNRahim, FAhmat, NJavid, MTAli, MKhan, KM Bisindolylmethane thiosemicarbazides as potential inhibitors of urease: Synthesis and molecular modeling studies. Bioorg Med Chem 26:152-160 (2018)  
Target
Name:
Urease
Synonyms:
UREA_CANEN | Urea amidohydrolase
Type:
Enzyme
Mol. Mass.:
90746.20
Organism:
Canavalia ensiformis (Jack bean) (Horse bean)
Description:
P07374
Residue:
840
  
Inhibitor
Name:
BDBM50452593
Synonyms:
CHEMBL4202962
Type:
Small organic molecule
Emp. Form.:
C40H32F2N8O2S2
Mol. Mass.:
758.861
SMILES:
Cc1ccc(cc1)C(c1c[nH]c2ccc(cc12)C(=O)NNC(=S)Nc1ccccc1F)c1c[nH]c2ccc(cc12)C(=O)NNC(=S)Nc1ccccc1F
: