Target
Calmodulin-sensitive adenylate cyclase
Ligand
BDBM50452679
Substrate
Meas. Tech.
ChEMBL_1748049 (CHEMBL4182559)
Ki
37700±n/a nM
Citation
 Jiao, GSKim, SMoayeri, MThai, ACregar-Hernandez, LMcKasson, LO'Malley, SLeppla, SHJohnson, AT Small molecule inhibitors of anthrax edema factor. Bioorg Med Chem Lett 28:134-139 (2018)  
Target
Name:
Calmodulin-sensitive adenylate cyclase
Synonyms:
CYAA_BACAN | cya
Type:
PROTEIN
Mol. Mass.:
92481.33
Organism:
Bacillus anthracis
Description:
ChEMBL_606615
Residue:
800
  
Inhibitor
Name:
BDBM50452679
Synonyms:
CHEMBL4217046
Type:
Small organic molecule
Emp. Form.:
C15H15FN6O3S
Mol. Mass.:
378.381
SMILES:
Nc1ncnc2n(CCCNC(=O)c3ccc(cc3)S(F)(=O)=O)cnc12
: