Target
Calmodulin-sensitive adenylate cyclase
Ligand
BDBM50452682
Substrate
Meas. Tech.
ChEMBL_1748049 (CHEMBL4182559)
Ki
14700±n/a nM
Citation
 Jiao, GSKim, SMoayeri, MThai, ACregar-Hernandez, LMcKasson, LO'Malley, SLeppla, SHJohnson, AT Small molecule inhibitors of anthrax edema factor. Bioorg Med Chem Lett 28:134-139 (2018)  
Target
Name:
Calmodulin-sensitive adenylate cyclase
Synonyms:
CYAA_BACAN | cya
Type:
PROTEIN
Mol. Mass.:
92481.33
Organism:
Bacillus anthracis
Description:
ChEMBL_606615
Residue:
800
  
Inhibitor
Name:
BDBM50452682
Synonyms:
CHEMBL4210973
Type:
Small organic molecule
Emp. Form.:
C18H21FN6O2S
Mol. Mass.:
404.462
SMILES:
Cc1nc(N)c2ncn(C3CCN(Cc4ccc(cc4)S(F)(=O)=O)CC3)c2n1
: