Target
Calmodulin-sensitive adenylate cyclase
Ligand
BDBM50452691
Substrate
Meas. Tech.
ChEMBL_1748049 (CHEMBL4182559)
Ki
300±n/a nM
Citation
 Jiao, GSKim, SMoayeri, MThai, ACregar-Hernandez, LMcKasson, LO'Malley, SLeppla, SHJohnson, AT Small molecule inhibitors of anthrax edema factor. Bioorg Med Chem Lett 28:134-139 (2018)  
Target
Name:
Calmodulin-sensitive adenylate cyclase
Synonyms:
CYAA_BACAN | cya
Type:
PROTEIN
Mol. Mass.:
92481.33
Organism:
Bacillus anthracis
Description:
ChEMBL_606615
Residue:
800
  
Inhibitor
Name:
BDBM50452691
Synonyms:
CHEMBL4218073
Type:
Small organic molecule
Emp. Form.:
C18H18FN5O3S
Mol. Mass.:
403.431
SMILES:
Nc1ncnc2n(ccc12)C1CCN(CC1)C(=O)c1ccc(cc1)S(F)(=O)=O
: