Target
Calmodulin-sensitive adenylate cyclase
Ligand
BDBM50452696
Substrate
Meas. Tech.
ChEMBL_1748049 (CHEMBL4182559)
Ki
954700±n/a nM
Citation
 Jiao, GSKim, SMoayeri, MThai, ACregar-Hernandez, LMcKasson, LO'Malley, SLeppla, SHJohnson, AT Small molecule inhibitors of anthrax edema factor. Bioorg Med Chem Lett 28:134-139 (2018)  
Target
Name:
Calmodulin-sensitive adenylate cyclase
Synonyms:
CYAA_BACAN | cya
Type:
PROTEIN
Mol. Mass.:
92481.33
Organism:
Bacillus anthracis
Description:
ChEMBL_606615
Residue:
800
  
Inhibitor
Name:
BDBM50452696
Synonyms:
CHEMBL4204524
Type:
Small organic molecule
Emp. Form.:
C12H11FN2O3S
Mol. Mass.:
282.291
SMILES:
Nc1cc(OCc2ccc(cc2)S(F)(=O)=O)ccn1
: