Target
Presenilin-1
Ligand
BDBM50452824
Substrate
Meas. Tech.
ChEMBL_1748462 (CHEMBL4182972)
IC50
1800±n/a nM
Citation
 Sekioka, RHonjo, EHonda, SFuji, HAkashiba, HMitani, YYamasaki, S Discovery of novel scaffolds for ?-secretase modulators without an arylimidazole moiety. Bioorg Med Chem 26:435-442 (2018)  
Target
Name:
Presenilin-1
Synonyms:
3.4.23.- Gamma-Secretase Subunit Presenilin-1 PS1 PSEN1 PSNL1 Presenilin-1 CTF12 Protein S182
Type:
Mol. Mass.:
52657.13
Organism:
Homo sapiens (Human)
Description:
P49768
Residue:
467
  
Inhibitor
Name:
BDBM50452824
Synonyms:
CHEMBL4213637
Type:
Small organic molecule
Emp. Form.:
C25H25ClN2O3
Mol. Mass.:
436.931
SMILES:
Cl.CCOC(=O)c1ccc(cc1)-c1c(C)nc2c(OCc3ccccc3C)cccn12
: