Target
Presenilin-1
Ligand
BDBM50452830
Substrate
Meas. Tech.
ChEMBL_1748462 (CHEMBL4182972)
IC50
8700±n/a nM
Citation
 Sekioka, RHonjo, EHonda, SFuji, HAkashiba, HMitani, YYamasaki, S Discovery of novel scaffolds for ?-secretase modulators without an arylimidazole moiety. Bioorg Med Chem 26:435-442 (2018)  
Target
Name:
Presenilin-1
Synonyms:
3.4.23.- Gamma-Secretase Subunit Presenilin-1 PS1 PSEN1 PSNL1 Presenilin-1 CTF12 Protein S182
Type:
Mol. Mass.:
52657.13
Organism:
Homo sapiens (Human)
Description:
P49768
Residue:
467
  
Inhibitor
Name:
BDBM50452830
Synonyms:
CHEMBL4203092
Type:
Small organic molecule
Emp. Form.:
C25H35Cl2N3O
Mol. Mass.:
464.471
SMILES:
Cl.Cl.CCCCN1CCC(CC1)c1c(C)nc2c(OCc3ccccc3C)cccn12
: