Target
Presenilin-1
Ligand
BDBM50452831
Substrate
Meas. Tech.
ChEMBL_1748462 (CHEMBL4182972)
IC50
5800±n/a nM
Citation
 Sekioka, RHonjo, EHonda, SFuji, HAkashiba, HMitani, YYamasaki, S Discovery of novel scaffolds for ?-secretase modulators without an arylimidazole moiety. Bioorg Med Chem 26:435-442 (2018)  
Target
Name:
Presenilin-1
Synonyms:
3.4.23.- Gamma-Secretase Subunit Presenilin-1 PS1 PSEN1 PSNL1 Presenilin-1 CTF12 Protein S182
Type:
Mol. Mass.:
52657.13
Organism:
Homo sapiens (Human)
Description:
P49768
Residue:
467
  
Inhibitor
Name:
BDBM50452831
Synonyms:
CHEMBL4207974
Type:
Small organic molecule
Emp. Form.:
C26H35Cl2N3O
Mol. Mass.:
476.482
SMILES:
Cl.Cl.Cc1nc2c(OCc3ccccc3)cccn2c1C1CCN(CC1)C1CCCCC1
: