Target
Beta-secretase 2
Ligand
BDBM47353
Substrate
Meas. Tech.
ChEMBL_1748662 (CHEMBL4183172)
IC50
0.380000±n/a nM
Citation
 O'Neill, BTBeck, EMButler, CRNolan, CEGonzales, CZhang, LDoran, SDLapham, KBuzon, LMDutra, JKBarreiro, GHou, XMartinez-Alsina, LARogers, BNVillalobos, AMurray, JCOgilvie, KLaChapelle, EAChang, CLanyon, LFSteppan, CMRobshaw, AHales, KBoucher, GGPandher, KHoule, CAmbroise, CWKaranian, DRiddell, DBales, KRBrodney, MA Design and Synthesis of Clinical Candidate PF-06751979: A Potent, Brain Penetrant, ?-Site Amyloid Precursor Protein Cleaving Enzyme 1 (BACE1) Inhibitor Lacking Hypopigmentation. J Med Chem 61:4476-4504 (2018)  
Target
Name:
Beta-secretase 2
Synonyms:
AEPLC ASP1 Asp 1 Aspartyl protease 1 BACE2_HUMAN Beta-secretase (BACE) Beta-secretase 2 (BACE-2) Beta-site APP-cleaving enzyme 2 Memapsin-1 beta-Secretase (BACE-2)
Type:
Protein
Mol. Mass.:
56171.20
Organism:
Homo sapiens (Human)
Description:
Q9Y5Z0
Residue:
518
  
Inhibitor
Name:
BDBM47353
Synonyms:
BDBM143220 US9687494, 25
Type:
Emp. Form.:
C17H17F2N5O3S
Mol. Mass.:
409.41
SMILES:
CN1C(=N)N[C@@](C)(CS1(=O)=O)c1cc(NC(=O)c2ccc(F)cn2)ccc1F
: