Target
Beta-secretase 2
Ligand
BDBM50452874
Substrate
Meas. Tech.
ChEMBL_1748662 (CHEMBL4183172)
IC50
0.900000±n/a nM
Citation
 O'Neill, BTBeck, EMButler, CRNolan, CEGonzales, CZhang, LDoran, SDLapham, KBuzon, LMDutra, JKBarreiro, GHou, XMartinez-Alsina, LARogers, BNVillalobos, AMurray, JCOgilvie, KLaChapelle, EAChang, CLanyon, LFSteppan, CMRobshaw, AHales, KBoucher, GGPandher, KHoule, CAmbroise, CWKaranian, DRiddell, DBales, KRBrodney, MA Design and Synthesis of Clinical Candidate PF-06751979: A Potent, Brain Penetrant, ?-Site Amyloid Precursor Protein Cleaving Enzyme 1 (BACE1) Inhibitor Lacking Hypopigmentation. J Med Chem 61:4476-4504 (2018)  
Target
Name:
Beta-secretase 2
Synonyms:
AEPLC ASP1 Asp 1 Aspartyl protease 1 BACE2_HUMAN Beta-secretase (BACE) Beta-secretase 2 (BACE-2) Beta-site APP-cleaving enzyme 2 Memapsin-1 beta-Secretase (BACE-2)
Type:
Protein
Mol. Mass.:
56171.20
Organism:
Homo sapiens (Human)
Description:
Q9Y5Z0
Residue:
518
  
Inhibitor
Name:
BDBM50452874
Synonyms:
CHEMBL4217620
Type:
Small organic molecule
Emp. Form.:
C26H28N4O
Mol. Mass.:
412.5267
SMILES:
CO[C@H]1CC[C@]2(Cc3ccc(cc3[C@@]22N=C(C)C(N)=N2)-c2cncc(c2)C#CC)CC1
: