Target
Neuropilin-1
Ligand
BDBM50453013
Substrate
Meas. Tech.
ChEMBL_1748923 (CHEMBL4183433)
Kd
3020±n/a nM
Citation
 Powell, JMota, FSteadman, DSoudy, CMiyauchi, JTCrosby, SJarvis, AReisinger, TWinfield, NEvans, GFinniear, AYelland, TChou, YTChan, AWEO'Leary, ACheng, LLiu, DFotinou, CMilagre, CMartin, JFJia, HFrankel, PDjordjevic, STsirka, SEZachary, ICSelwood, DL Small Molecule Neuropilin-1 Antagonists Combine Antiangiogenic and Antitumor Activity with Immune Modulation through Reduction of Transforming Growth Factor Beta (TGF?) Production in Regulatory T-Cells. J Med Chem 61:4135-4154 (2018)  
Target
Name:
Neuropilin-1
Synonyms:
Chain A, Crystal Structure Of The B1b2 Domains From Human Neuropilin- 1 NRP1 Neuropilin-1 | VEGF165R
Type:
PROTEIN
Mol. Mass.:
103122.09
Organism:
Homo sapiens (Human)
Description:
ChEMBL_617636
Residue:
923
  
Inhibitor
Name:
BDBM50453013
Synonyms:
CHEMBL4206494
Type:
Small organic molecule
Emp. Form.:
C33H41N7O7S2
Mol. Mass.:
711.851
SMILES:
CNC(=O)C1CCN(Cc2ccccc2-c2cc3CCOc3c(c2)S(=O)(=O)Nc2ccsc2C(=O)N[C@@H](CCCNC(N)=N)C(O)=O)CC1
: