Target
Ornithine decarboxylase
Ligand
BDBM50020274
Substrate
Meas. Tech.
ChEBML_148130
Ki
10000±n/a nM
Citation
 Kendrick, DADanzin, CKolb, M 2,2-Difluoro-5-hexyne-1,4-diamine: a potent enzyme-activated inhibitor of ornithine decarboxylase. J Med Chem 32:170-3 (1989)  
Target
Name:
Ornithine decarboxylase
Synonyms:
DCOR_RAT Odc1
Type:
PROTEIN
Mol. Mass.:
51037.04
Organism:
Rattus norvegicus
Description:
ChEMBL_1344641
Residue:
461
  
Inhibitor
Name:
BDBM50020274
Synonyms:
2,2-Difluoro-hex-5-yne-1,4-diamonium; dichloride | CHEMBL47011
Type:
Small organic molecule
Emp. Form.:
C6H12F2N2
Mol. Mass.:
150.1686
SMILES:
[NH3+]CC(F)(F)CC([NH3+])C#C
: