Target
Cryptochrome-2
Ligand
BDBM50453617
Substrate
Meas. Tech.
ChEMBL_1750223 (CHEMBL4184983)
EC50
3732±n/a nM
Citation
  TBA Bioorg Med Chem Lett 28:293-297 (2018)  
Target
Name:
Cryptochrome-2
Synonyms:
CRY2 Cryptochrome-2 | KIAA0658
Type:
PROTEIN
Mol. Mass.:
66958.43
Organism:
Homo sapiens
Description:
ChEMBL_118347
Residue:
593
  
Inhibitor
Name:
BDBM50453617
Synonyms:
CHEMBL4209495
Type:
Small organic molecule
Emp. Form.:
C23H18F2N2O2
Mol. Mass.:
392.398
SMILES:
OC(CN1C(=O)Cc2ccccc12)Cn1c2ccc(F)cc2c2cc(F)ccc12
: