Target
Cryptochrome-2
Ligand
BDBM50453618
Substrate
Meas. Tech.
ChEMBL_1750223 (CHEMBL4184983)
EC50
1138±n/a nM
Citation
  TBA Bioorg Med Chem Lett 28:293-297 (2018)  
Target
Name:
Cryptochrome-2
Synonyms:
CRY2 Cryptochrome-2 | KIAA0658
Type:
PROTEIN
Mol. Mass.:
66958.43
Organism:
Homo sapiens
Description:
ChEMBL_118347
Residue:
593
  
Inhibitor
Name:
BDBM50453618
Synonyms:
CHEMBL4218453
Type:
Small organic molecule
Emp. Form.:
C20H20F2N2O3
Mol. Mass.:
374.3812
SMILES:
COC1CN(CC(O)Cn2c3ccc(F)cc3c3cc(F)ccc23)C(=O)C1
: