Target
Cryptochrome-2
Ligand
BDBM50453620
Substrate
Meas. Tech.
ChEMBL_1750223 (CHEMBL4184983)
EC50
9768±n/a nM
Citation
  TBA Bioorg Med Chem Lett 28:293-297 (2018)  
Target
Name:
Cryptochrome-2
Synonyms:
CRY2 Cryptochrome-2 | KIAA0658
Type:
PROTEIN
Mol. Mass.:
66958.43
Organism:
Homo sapiens
Description:
ChEMBL_118347
Residue:
593
  
Inhibitor
Name:
BDBM50453620
Synonyms:
CHEMBL4205644
Type:
Small organic molecule
Emp. Form.:
C18H16F2N2O3
Mol. Mass.:
346.328
SMILES:
OC(CN1CCOC1=O)Cn1c2ccc(F)cc2c2cc(F)ccc12
: