Target
Cryptochrome-2
Ligand
BDBM356933
Substrate
Meas. Tech.
ChEMBL_1750223 (CHEMBL4184983)
EC50
163±n/a nM
Citation
  TBA Bioorg Med Chem Lett 28:293-297 (2018)  
Target
Name:
Cryptochrome-2
Synonyms:
CRY2 Cryptochrome-2 | KIAA0658
Type:
PROTEIN
Mol. Mass.:
66958.43
Organism:
Homo sapiens
Description:
ChEMBL_118347
Residue:
593
  
Inhibitor
Name:
BDBM356933
Synonyms:
2-(3-(3,6-difluoro- 9H-carbazol-9-yl)-2- hydroxypropyl)-2- azabicyclo[2.2.1] heptan-3-one US10759777, Compound 48
Type:
Small organic molecule
Emp. Form.:
C21H20F2N2O2
Mol. Mass.:
370.3925
SMILES:
OC(CN1C2CCC(C2)C1=O)Cn1c2ccc(F)cc2c2cc(F)ccc12
: