Target
Cryptochrome-2
Ligand
BDBM356636
Substrate
Meas. Tech.
ChEMBL_1750223 (CHEMBL4184983)
EC50
188±n/a nM
Citation
  TBA Bioorg Med Chem Lett 28:293-297 (2018)  
Target
Name:
Cryptochrome-2
Synonyms:
CRY2 Cryptochrome-2 | KIAA0658
Type:
PROTEIN
Mol. Mass.:
66958.43
Organism:
Homo sapiens
Description:
ChEMBL_118347
Residue:
593
  
Inhibitor
Name:
BDBM356636
Synonyms:
US10214507, Compound 71 | US10759777, Compound 71
Type:
Small organic molecule
Emp. Form.:
C19H19F2N3O2
Mol. Mass.:
359.3699
SMILES:
OC(CN1CCCNC1=O)Cn1c2ccc(F)cc2c2cc(F)ccc12
: