Target
Cryptochrome-2
Ligand
BDBM356641
Substrate
Meas. Tech.
ChEMBL_1750223 (CHEMBL4184983)
EC50
1059±n/a nM
Citation
  TBA Bioorg Med Chem Lett 28:293-297 (2018)  
Target
Name:
Cryptochrome-2
Synonyms:
CRY2 Cryptochrome-2 | KIAA0658
Type:
PROTEIN
Mol. Mass.:
66958.43
Organism:
Homo sapiens
Description:
ChEMBL_118347
Residue:
593
  
Inhibitor
Name:
BDBM356641
Synonyms:
1-(3-(3,6-difluoro- 9H-carbazol-9-yl)-2- hydroxypropyl)-3- ethylimidazolidin-2- one US10759777, Compound 73
Type:
Small organic molecule
Emp. Form.:
C20H21F2N3O2
Mol. Mass.:
373.3964
SMILES:
CCN1CCN(CC(O)Cn2c3ccc(F)cc3c3cc(F)ccc23)C1=O
: