Target
Cryptochrome-2
Ligand
BDBM50453627
Substrate
Meas. Tech.
ChEMBL_1750223 (CHEMBL4184983)
EC50
417±n/a nM
Citation
  TBA Bioorg Med Chem Lett 28:293-297 (2018)  
Target
Name:
Cryptochrome-2
Synonyms:
CRY2 Cryptochrome-2 | KIAA0658
Type:
PROTEIN
Mol. Mass.:
66958.43
Organism:
Homo sapiens
Description:
ChEMBL_118347
Residue:
593
  
Inhibitor
Name:
BDBM50453627
Synonyms:
CHEMBL4208268
Type:
Small organic molecule
Emp. Form.:
C20H21F2N3O2
Mol. Mass.:
373.3964
SMILES:
CC1CCN(CC(O)Cn2c3ccc(F)cc3c3cc(F)ccc23)C(=O)N1
: