Target
Cryptochrome-2
Ligand
BDBM50453636
Substrate
Meas. Tech.
ChEMBL_1750223 (CHEMBL4184983)
EC50
15222±n/a nM
Citation
  TBA Bioorg Med Chem Lett 28:293-297 (2018)  
Target
Name:
Cryptochrome-2
Synonyms:
CRY2 Cryptochrome-2 | KIAA0658
Type:
PROTEIN
Mol. Mass.:
66958.43
Organism:
Homo sapiens
Description:
ChEMBL_118347
Residue:
593
  
Inhibitor
Name:
BDBM50453636
Synonyms:
CHEMBL4213698
Type:
Small organic molecule
Emp. Form.:
C24H20F2N2O2
Mol. Mass.:
406.4246
SMILES:
OC(CN1Cc2ccccc2CC1=O)Cn1c2ccc(F)cc2c2cc(F)ccc12
: