Target
Nucleosome-remodeling factor subunit BPTF
Ligand
BDBM179481
Substrate
Meas. Tech.
ChEMBL_1750698 (CHEMBL4185458)
Kd
>4000±n/a nM
Citation
 Zhao, YBai, LLiu, LMcEachern, DStuckey, JAMeagher, JLYang, CYRan, XZhou, BHu, YLi, XWen, BZhao, TLi, SSun, DWang, S Structure-Based Discovery of 4-(6-Methoxy-2-methyl-4-(quinolin-4-yl)-9H-pyrimido[4,5-b]indol-7-yl)-3,5-dimethylisoxazole (CD161) as a Potent and Orally Bioavailable BET Bromodomain Inhibitor. J Med Chem 60:3887-3901 (2017)  
Target
Name:
Nucleosome-remodeling factor subunit BPTF
Synonyms:
BPTF Bromodomain and PHD finger-containing transcription factor FALZ Fetal Alzheimer antigen
Type:
PROTEIN
Mol. Mass.:
338257.07
Organism:
Homo sapiens (Human)
Description:
ChEMBL_107969
Residue:
3046
  
Inhibitor
Name:
BDBM179481
Synonyms:
US9675697, Cpd. No. 73
Type:
Small organic molecule
Emp. Form.:
C26H21N5O2
Mol. Mass.:
435.4772
SMILES:
COc1cc2c(cc1-c1c(C)noc1C)[nH]c1nc(C)nc(-c3ccnc4ccccc34)c21
: