Target
Bromodomain-containing protein 4
Ligand
BDBM179481
Substrate
Meas. Tech.
ChEMBL_1750645 (CHEMBL4185405)
Ki
1.4±n/a nM
Citation
 Zhao, YBai, LLiu, LMcEachern, DStuckey, JAMeagher, JLYang, CYRan, XZhou, BHu, YLi, XWen, BZhao, TLi, SSun, DWang, S Structure-Based Discovery of 4-(6-Methoxy-2-methyl-4-(quinolin-4-yl)-9H-pyrimido[4,5-b]indol-7-yl)-3,5-dimethylisoxazole (CD161) as a Potent and Orally Bioavailable BET Bromodomain Inhibitor. J Med Chem 60:3887-3901 (2017)  
Target
Name:
Bromodomain-containing protein 4
Synonyms:
BRD4 Bromodomain-containing protein 4 (BRD4) Protein HUNK1
Type:
Protein
Mol. Mass.:
152264.84
Organism:
Homo sapiens (Human)
Description:
O60885
Residue:
1362
  
Inhibitor
Name:
BDBM179481
Synonyms:
US9675697, Cpd. No. 73
Type:
Small organic molecule
Emp. Form.:
C26H21N5O2
Mol. Mass.:
435.4772
SMILES:
COc1cc2c(cc1-c1c(C)noc1C)[nH]c1nc(C)nc(-c3ccnc4ccccc34)c21
: