Target
Sialidase
Ligand
BDBM5216
Substrate
Meas. Tech.
ChEMBL_1751542 (CHEMBL4186302)
IC50
22±n/a nM
Citation
 Wang, ZCheng, LPZhang, XHPang, WLi, LZhao, JL Design, synthesis and biological evaluation of novel oseltamivir derivatives as potent neuraminidase inhibitors. Bioorg Med Chem Lett 27:5429-5435 (2017)  
Target
Name:
Sialidase
Synonyms:
NANH_CLOPF | nanH
Type:
PROTEIN
Mol. Mass.:
42808.79
Organism:
Clostridium perfringens
Description:
ChEMBL_991336
Residue:
382
  
Inhibitor
Name:
BDBM5216
Synonyms:
(3R,4R,5S)-5-amino-3-(cyclopentyloxy)-4-acetamidocyclohex-1-ene-1-carboxylic acid | carbocyclic analogue 7
Type:
Small organic molecule
Emp. Form.:
C14H22N2O4
Mol. Mass.:
282.3355
SMILES:
CC(=O)N[C@@H]1[C@@H](N)CC(=C[C@H]1OC1CCCC1)C(O)=O
: