Target
Sialidase
Ligand
BDBM4991
Substrate
Meas. Tech.
ChEMBL_1751542 (CHEMBL4186302)
IC50
200±n/a nM
Citation
 Wang, ZCheng, LPZhang, XHPang, WLi, LZhao, JL Design, synthesis and biological evaluation of novel oseltamivir derivatives as potent neuraminidase inhibitors. Bioorg Med Chem Lett 27:5429-5435 (2017)  
Target
Name:
Sialidase
Synonyms:
NANH_CLOPF | nanH
Type:
PROTEIN
Mol. Mass.:
42808.79
Organism:
Clostridium perfringens
Description:
ChEMBL_991336
Residue:
382
  
Inhibitor
Name:
BDBM4991
Synonyms:
(3R,4R,5S)-5-amino-4-acetamido-3-(2-methylpropoxy)cyclohex-1-ene-1-carboxylic acid | Carbocyclic Analogue 42
Type:
Small organic molecule
Emp. Form.:
C13H22N2O4
Mol. Mass.:
270.3248
SMILES:
CC(C)CO[C@@H]1C=C(C[C@H](N)[C@H]1NC(C)=O)C(O)=O
: