Target
Sialidase
Ligand
BDBM4995
Substrate
Meas. Tech.
ChEMBL_1751542 (CHEMBL4186302)
IC50
1.000000±n/a nM
Citation
 Wang, ZCheng, LPZhang, XHPang, WLi, LZhao, JL Design, synthesis and biological evaluation of novel oseltamivir derivatives as potent neuraminidase inhibitors. Bioorg Med Chem Lett 27:5429-5435 (2017)  
Target
Name:
Sialidase
Synonyms:
NANH_CLOPF | nanH
Type:
PROTEIN
Mol. Mass.:
42808.79
Organism:
Clostridium perfringens
Description:
ChEMBL_991336
Residue:
382
  
Inhibitor
Name:
BDBM4995
Synonyms:
(3R,4R,5S)-4-Acetamido-5-amino-3-[[(1S)-1-ethylbut-3-enyl]oxy]-1-cyclohexene-1-carboxylic Acid Carbocyclic Analogue 45
Type:
Small organic molecule
Emp. Form.:
C15H24N2O4
Mol. Mass.:
296.3621
SMILES:
CC[C@@H](CC=C)O[C@@H]1C=C(C[C@H](N)[C@H]1NC(C)=O)C(O)=O
: