Target
Sialidase
Ligand
BDBM5226
Substrate
Meas. Tech.
ChEMBL_1751542 (CHEMBL4186302)
IC50
180±n/a nM
Citation
 Wang, ZCheng, LPZhang, XHPang, WLi, LZhao, JL Design, synthesis and biological evaluation of novel oseltamivir derivatives as potent neuraminidase inhibitors. Bioorg Med Chem Lett 27:5429-5435 (2017)  
Target
Name:
Sialidase
Synonyms:
NANH_CLOPF | nanH
Type:
PROTEIN
Mol. Mass.:
42808.79
Organism:
Clostridium perfringens
Description:
ChEMBL_991336
Residue:
382
  
Inhibitor
Name:
BDBM5226
Synonyms:
(3R,4R,5S)-5-amino-3-[butyl(methyl)amino]-4-acetamidocyclohex-1-ene-1-carboxylic acid | C3-Aza Carbocyclic Analogue 3b
Type:
Small organic molecule
Emp. Form.:
C14H25N3O3
Mol. Mass.:
283.3666
SMILES:
CCCCN(C)[C@@H]1C=C(C[C@H](N)[C@H]1NC(C)=O)C(O)=O
: