Target
Sialidase
Ligand
BDBM50028503
Substrate
Meas. Tech.
ChEMBL_1751542 (CHEMBL4186302)
IC50
0.500035±n/a nM
Citation
 Wang, ZCheng, LPZhang, XHPang, WLi, LZhao, JL Design, synthesis and biological evaluation of novel oseltamivir derivatives as potent neuraminidase inhibitors. Bioorg Med Chem Lett 27:5429-5435 (2017)  
Target
Name:
Sialidase
Synonyms:
NANH_CLOPF | nanH
Type:
PROTEIN
Mol. Mass.:
42808.79
Organism:
Clostridium perfringens
Description:
ChEMBL_991336
Residue:
382
  
Inhibitor
Name:
BDBM50028503
Synonyms:
CHEMBL81717 | Guanidino-Oseltamivir Carboxylicacid
Type:
Small organic molecule
Emp. Form.:
C15H26N4O4
Mol. Mass.:
326.3913
SMILES:
CCC(CC)O[C@@H]1C=C(C[C@H](NC(N)=N)[C@H]1NC(C)=O)C(O)=O
: