Target
Sialidase
Ligand
BDBM4993
Substrate
Meas. Tech.
ChEMBL_1751542 (CHEMBL4186302)
IC50
10.0±n/a nM
Citation
 Wang, ZCheng, LPZhang, XHPang, WLi, LZhao, JL Design, synthesis and biological evaluation of novel oseltamivir derivatives as potent neuraminidase inhibitors. Bioorg Med Chem Lett 27:5429-5435 (2017)  
Target
Name:
Sialidase
Synonyms:
NANH_CLOPF | nanH
Type:
PROTEIN
Mol. Mass.:
42808.79
Organism:
Clostridium perfringens
Description:
ChEMBL_991336
Residue:
382
  
Inhibitor
Name:
BDBM4993
Synonyms:
(3R,4R,5S)-5-amino-3-[(2S)-butan-2-yloxy]-4-acetamidocyclohex-1-ene-1-carboxylic acid | Carbocyclic Analogue 44
Type:
Small organic molecule
Emp. Form.:
C13H22N2O4
Mol. Mass.:
270.3248
SMILES:
CC[C@H](C)O[C@@H]1C=C(C[C@H](N)[C@H]1NC(C)=O)C(O)=O
: