Target
Sialidase
Ligand
BDBM5214
Substrate
Meas. Tech.
ChEMBL_1751542 (CHEMBL4186302)
IC50
225±n/a nM
Citation
 Wang, ZCheng, LPZhang, XHPang, WLi, LZhao, JL Design, synthesis and biological evaluation of novel oseltamivir derivatives as potent neuraminidase inhibitors. Bioorg Med Chem Lett 27:5429-5435 (2017)  
Target
Name:
Sialidase
Synonyms:
NANH_CLOPF | nanH
Type:
PROTEIN
Mol. Mass.:
42808.79
Organism:
Clostridium perfringens
Description:
ChEMBL_991336
Residue:
382
  
Inhibitor
Name:
BDBM5214
Synonyms:
(3R,4R,5S)-5-amino-4-acetamido-3-(3,3,3-trifluoropropoxy)cyclohex-1-ene-1-carboxylic acid | carbocyclic analogue 5
Type:
Small organic molecule
Emp. Form.:
C12H17F3N2O4
Mol. Mass.:
310.2696
SMILES:
CC(=O)N[C@@H]1[C@@H](N)CC(=C[C@H]1OCCC(F)(F)F)C(O)=O
: