Target
Sialidase
Ligand
BDBM5007
Substrate
Meas. Tech.
ChEMBL_1751542 (CHEMBL4186302)
IC50
90±n/a nM
Citation
 Wang, ZCheng, LPZhang, XHPang, WLi, LZhao, JL Design, synthesis and biological evaluation of novel oseltamivir derivatives as potent neuraminidase inhibitors. Bioorg Med Chem Lett 27:5429-5435 (2017)  
Target
Name:
Sialidase
Synonyms:
NANH_CLOPF | nanH
Type:
PROTEIN
Mol. Mass.:
42808.79
Organism:
Clostridium perfringens
Description:
ChEMBL_991336
Residue:
382
  
Inhibitor
Name:
BDBM5007
Synonyms:
(3R,4R,5S)-4-Acetamido-5-amino-3-(3-biphenylylpropoxy)-1-cyclohexene-1-carboxylic Acid Carbocyclic Analogue 57
Type:
Small organic molecule
Emp. Form.:
C24H28N2O4
Mol. Mass.:
408.4901
SMILES:
CC(=O)N[C@@H]1[C@@H](N)CC(=C[C@H]1OCCCc1ccc(cc1)-c1ccccc1)C(O)=O
: