Target
Sialidase
Ligand
BDBM50453893
Substrate
Meas. Tech.
ChEMBL_1751542 (CHEMBL4186302)
IC50
0.500035±n/a nM
Citation
 Wang, ZCheng, LPZhang, XHPang, WLi, LZhao, JL Design, synthesis and biological evaluation of novel oseltamivir derivatives as potent neuraminidase inhibitors. Bioorg Med Chem Lett 27:5429-5435 (2017)  
Target
Name:
Sialidase
Synonyms:
NANH_CLOPF | nanH
Type:
PROTEIN
Mol. Mass.:
42808.79
Organism:
Clostridium perfringens
Description:
ChEMBL_991336
Residue:
382
  
Inhibitor
Name:
BDBM50453893
Synonyms:
CHEMBL3220445
Type:
Small organic molecule
Emp. Form.:
C14H24N4O4
Mol. Mass.:
312.3648
SMILES:
CC[C@H](C)O[C@@H]1C=C(C[C@H](NC(N)=N)[C@H]1NC(C)=O)C(O)=O
: