Target
Bromodomain-containing protein 1
Ligand
BDBM50453949
Substrate
Meas. Tech.
ChEMBL_1751648 (CHEMBL4186408)
Kd
4700±n/a nM
Citation
 Lai, KWRomero, FATsui, VBeresini, MHde Leon Boenig, GBronner, SMChen, KChen, ZChoo, EFCrawford, TDCyr, PKaufman, SLi, YLiao, JLiu, WLy, JMurray, JShen, WWai, JWang, FZhu, CZhu, XMagnuson, S Design and synthesis of a biaryl series as inhibitors for the bromodomains of CBP/P300. Bioorg Med Chem Lett 28:15-23 (2018)  
Target
Name:
Bromodomain-containing protein 1
Synonyms:
BR140-like protein BRD1_HUMAN BRL Bromodomain and PHD finger-containing protein 2 | Bromodomain-containing protein 1
Type:
PROTEIN
Mol. Mass.:
119557.65
Organism:
Homo sapiens (Human)
Description:
ChEMBL_105349
Residue:
1058
  
Inhibitor
Name:
BDBM50453949
Synonyms:
CHEMBL4208820 | US11247989, Example 87
Type:
Small organic molecule
Emp. Form.:
C29H30N6O3
Mol. Mass.:
510.5869
SMILES:
CNC(=O)c1ccc(cn1)-c1cc2cccc(-c3nn(C4CCOCC4)c4CCN(Cc34)C(C)=O)c2cn1
: