Target
Corticotropin-releasing factor receptor 1
Ligand
BDBM50116123
Substrate
Meas. Tech.
ChEMBL_1752224 (CHEMBL4186984)
Ki
2.0±n/a nM
Citation
 Cherukupalli, SHampannavar, GAChinnam, SChandrasekaran, BSayyad, NKayamba, FReddy Aleti, RKarpoormath, R An appraisal on synthetic and pharmaceutical perspectives of pyrazolo[4,3-d]pyrimidine scaffold. Bioorg Med Chem 26:309-339 (2018)  
Target
Name:
Corticotropin-releasing factor receptor 1
Synonyms:
CRF-R CRF1 CRFR1 CRH-R 1 CRHR1 Corticotropin-releasing factor receptor 1 (CRF-1) Corticotropin-releasing hormone receptor 1
Type:
Enzyme
Mol. Mass.:
50744.31
Organism:
Homo sapiens (Human)
Description:
P34998
Residue:
444
  
Inhibitor
Name:
BDBM50116123
Synonyms:
Butyl-[3-(2,4-dichloro-phenyl)-2,5-dimethyl-2H-pyrazolo[4,3-d]pyrimidin-7-yl]-ethyl-amine | CHEMBL303380
Type:
Small organic molecule
Emp. Form.:
C19H23Cl2N5
Mol. Mass.:
392.325
SMILES:
CCCCN(CC)c1nc(C)nc2c(-c3ccc(Cl)cc3Cl)n(C)nc12
: