Target
Carbonic anhydrase 12
Ligand
BDBM50454291
Substrate
Meas. Tech.
ChEMBL_1752592 (CHEMBL4187352)
Kd
88±n/a nM
Citation
 ?apkauskait?, EZak?auskas, ARuibys, VLinkuvien?, VPaketuryt?, VGedgaudas, MKairys, VMatulis, D Benzimidazole design, synthesis, and docking to build selective carbonic anhydrase VA inhibitors. Bioorg Med Chem 26:675-687 (2018)  
Target
Name:
Carbonic anhydrase 12
Synonyms:
CA-XII CAH12_HUMAN Carbonic anhydrase Carbonic anhydrase XII Carbonic anhydrase XII (CAXII) | Tumor antigen HOM-RCC-3.1.3
Type:
Enzyme
Mol. Mass.:
39456.00
Organism:
Homo sapiens (Human)
Description:
Catalytic domain of human cloned isozyme was used in the assay
Residue:
354
  
Inhibitor
Name:
BDBM50454291
Synonyms:
CHEMBL4207242
Type:
Small organic molecule
Emp. Form.:
C23H20ClN3O3S2
Mol. Mass.:
486.006
SMILES:
Cc1cc2ncn(CC(=O)c3cc(c(Cl)cc3Sc3ccccc3)S(N)(=O)=O)c2cc1C
: