Target
Carbonic anhydrase 5B, mitochondrial
Ligand
BDBM50454292
Substrate
Meas. Tech.
ChEMBL_1752588 (CHEMBL4187348)
Kd
29±n/a nM
Citation
 ?apkauskait?, EZak?auskas, ARuibys, VLinkuvien?, VPaketuryt?, VGedgaudas, MKairys, VMatulis, D Benzimidazole design, synthesis, and docking to build selective carbonic anhydrase VA inhibitors. Bioorg Med Chem 26:675-687 (2018)  
Target
Name:
Carbonic anhydrase 5B, mitochondrial
Synonyms:
CA-VB CAH5B_HUMAN Carbonic Anhydrase VB Carbonic anhydrase 5B, mitochondrial Carbonic anhydrase V | Carbonic anhydrase VB (CA VB)
Type:
Enzyme
Mol. Mass.:
36440.83
Organism:
Homo sapiens (Human)
Description:
Human (cloned) isozyme
Residue:
317
  
Inhibitor
Name:
BDBM50454292
Synonyms:
CHEMBL4208414
Type:
Small organic molecule
Emp. Form.:
C13H14ClN3O3S
Mol. Mass.:
327.787
SMILES:
CCc1nccn1CC(=O)c1ccc(Cl)c(c1)S(N)(=O)=O
: