Target
Carbonic anhydrase 13
Ligand
BDBM50454311
Substrate
Meas. Tech.
ChEMBL_1752581 (CHEMBL4187341)
Kd
294±n/a nM
Citation
 ?apkauskait?, EZak?auskas, ARuibys, VLinkuvien?, VPaketuryt?, VGedgaudas, MKairys, VMatulis, D Benzimidazole design, synthesis, and docking to build selective carbonic anhydrase VA inhibitors. Bioorg Med Chem 26:675-687 (2018)  
Target
Name:
Carbonic anhydrase 13
Synonyms:
CA13 Carbonic anhydrase Carbonic anhydrase XIII (CA XIII)
Type:
Enzyme
Mol. Mass.:
29445.78
Organism:
Homo sapiens (Human)
Description:
Q8N1Q1
Residue:
262
  
Inhibitor
Name:
BDBM50454311
Synonyms:
CHEMBL4214894
Type:
Small organic molecule
Emp. Form.:
C23H20ClN3O3S2
Mol. Mass.:
486.006
SMILES:
NS(=O)(=O)c1cc(C(=O)Cn2cnc3ccccc23)c(SCCc2ccccc2)cc1Cl
: