Target
Carbonic anhydrase 7
Ligand
BDBM50454304
Substrate
Meas. Tech.
ChEMBL_1752578 (CHEMBL4187338)
Kd
2220±n/a nM
Citation
 ?apkauskait?, EZak?auskas, ARuibys, VLinkuvien?, VPaketuryt?, VGedgaudas, MKairys, VMatulis, D Benzimidazole design, synthesis, and docking to build selective carbonic anhydrase VA inhibitors. Bioorg Med Chem 26:675-687 (2018)  
Target
Name:
Carbonic anhydrase 7
Synonyms:
CA-VII CAH7_HUMAN Carbonic anhydrase Carbonic anhydrase VII (CA VII)
Type:
Enzyme
Mol. Mass.:
29664.11
Organism:
Homo sapiens (Human)
Description:
Human cloned isozyme.
Residue:
264
  
Inhibitor
Name:
BDBM50454304
Synonyms:
CHEMBL4204892
Type:
Small organic molecule
Emp. Form.:
C17H14ClN3O3S
Mol. Mass.:
375.829
SMILES:
NS(=O)(=O)c1cc(ccc1Cl)C(=O)Cn1ccnc1-c1ccccc1
: