Target
Carbonic anhydrase 12
Ligand
BDBM50454315
Substrate
Meas. Tech.
ChEMBL_1752592 (CHEMBL4187352)
Kd
19±n/a nM
Citation
 ?apkauskait?, EZak?auskas, ARuibys, VLinkuvien?, VPaketuryt?, VGedgaudas, MKairys, VMatulis, D Benzimidazole design, synthesis, and docking to build selective carbonic anhydrase VA inhibitors. Bioorg Med Chem 26:675-687 (2018)  
Target
Name:
Carbonic anhydrase 12
Synonyms:
CA-XII CAH12_HUMAN Carbonic anhydrase Carbonic anhydrase XII Carbonic anhydrase XII (CAXII) | Tumor antigen HOM-RCC-3.1.3
Type:
Enzyme
Mol. Mass.:
39456.00
Organism:
Homo sapiens (Human)
Description:
Catalytic domain of human cloned isozyme was used in the assay
Residue:
354
  
Inhibitor
Name:
BDBM50454315
Synonyms:
CHEMBL4204729
Type:
Small organic molecule
Emp. Form.:
C11H10ClN3O3S
Mol. Mass.:
299.733
SMILES:
NS(=O)(=O)c1cc(ccc1Cl)C(=O)Cn1ccnc1
: