Target
Carbonic anhydrase 1
Ligand
BDBM50329832
Substrate
Meas. Tech.
ChEMBL_1752571 (CHEMBL4187331)
Kd
11100±n/a nM
Citation
 ?apkauskait?, EZak?auskas, ARuibys, VLinkuvien?, VPaketuryt?, VGedgaudas, MKairys, VMatulis, D Benzimidazole design, synthesis, and docking to build selective carbonic anhydrase VA inhibitors. Bioorg Med Chem 26:675-687 (2018)  
Target
Name:
Carbonic anhydrase 1
Synonyms:
CA-I CAB Carbonate dehydratase I Carbonic anhydrase 1 (CA I) Carbonic anhydrase 1 (Recombinant CA I) Carbonic anhydrase B Carbonic anhydrase I (CA I) Carbonic anhydrase I (CAI) Carbonic anhydrase isoenzyme I (hCA I) | hCA
Type:
Enzyme
Mol. Mass.:
28873.37
Organism:
Homo sapiens (Human)
Description:
P00915
Residue:
261
  
Inhibitor
Name:
BDBM50329832
Synonyms:
5-(1H-Benzimidazol-1-ylacetyl)-2-chlorobenzenesulfonamide N-alkylated benzimidazole derivative, 4a | carbonic anhydrase (CA) inhibitors, benzenesulphonamide ligand, 4
Type:
Small organic molecule
Emp. Form.:
C15H12ClN3O3S
Mol. Mass.:
349.792
SMILES:
NS(=O)(=O)c1cc(ccc1Cl)C(=O)Cn1cnc2ccccc12
: