Target
Cyclin-T1/Cyclin-dependent kinase 9
Ligand
BDBM50454379
Substrate
Meas. Tech.
ChEMBL_1752661 (CHEMBL4187421)
IC50
1.000000±n/a nM
Citation
 Czudor, ZBalogh, MBánhegyi, PBoros, SBreza, NDobos, JFábián, MHorváth, ZIllyés, EMarkó, PSipos, ASzántai-Kis, CSzokol, B?rfi, L Novel compounds with potent CDK9 inhibitory activity for the treatment of myeloma. Bioorg Med Chem Lett 28:769-773 (2018)  
Target
Name:
Cyclin-T1/Cyclin-dependent kinase 9
Synonyms:
CDK9/ Cyclin-T1 CDK9/Cyclin T Cyclin T1/dependent kinase 9 | Cyclin-Dependent Kinase 9 (CDK9)
Type:
Protein Complex
Mol. Mass.:
Description:
Components:
This complex has 2 components.
Component 1
Name:
Cyclin-T1
Synonyms:
CCNT1 CycT Cyclin T Cyclin-T
Type:
Enzyme Subunit
Mol. Mass.:
80712.40
Organism:
Homo sapiens (Human)
Description:
Residue:
726
  
Component 2
Name:
Cyclin-dependent kinase 9
Synonyms:
C-2K CDK9 Cell division cycle 2-like protein kinase 4 Cyclin-Dependent Kinase 9 (CDK9) Serine/threonine-protein kinase PITALRE Tat-associated kinase complex catalytic subunit
Type:
Enzyme Subunit
Mol. Mass.:
42789.13
Organism:
Homo sapiens (Human)
Description:
Residue:
372
  
Inhibitor
Name:
BDBM50454379
Synonyms:
CHEMBL4205123
Type:
Small organic molecule
Emp. Form.:
C22H19F2N5O4S
Mol. Mass.:
487.479
SMILES:
COc1ccc(F)c(F)c1-c1ccnc(Nc2ccc(cc2)S(=O)(=O)Nc2onc(C)c2C)n1
: