Target
Aldehyde dehydrogenase 1A1
Ligand
BDBM50456226
Substrate
Meas. Tech.
ChEMBL_1755242 (CHEMBL4190002)
EC50
7790±n/a nM
Citation
 Yang, SMMartinez, NJYasgar, ADanchik, CJohansson, CWang, YBaljinnyam, BWang, AQXu, XShah, PCheff, DWang, XSRoth, JLal-Nag, MDunford, JEOppermann, UVasiliou, VSimeonov, AJadhav, AMaloney, DJ Discovery of Orally Bioavailable, Quinoline-Based Aldehyde Dehydrogenase 1A1 (ALDH1A1) Inhibitors with Potent Cellular Activity. J Med Chem 61:4883-4903 (2018)  
Target
Name:
Aldehyde dehydrogenase 1A1
Synonyms:
AL1A1_HUMAN ALDH-E1 ALDH1A1 Aldehyde dehydrogenase 1A1 (ALDH1A1) Aldehyde dehydrogenase family 1 member A1 (ALDH1A1) PUMB1 RalDH1 | Retinal dehydrogenase 1
Type:
Protein
Mol. Mass.:
54862.21
Organism:
Homo sapiens (Human)
Description:
Residue:
501
  
Inhibitor
Name:
BDBM50456226
Synonyms:
CHEMBL4215649
Type:
Small organic molecule
Emp. Form.:
C21H32N6O3
Mol. Mass.:
416.5172
SMILES:
CC(C)CCn1c(CN2CCN(CC2)C(=O)C2CC2)nc2n(C)c(=O)n(C)c(=O)c12
: