Target
Potassium voltage-gated channel subfamily A member 4
Ligand
BDBM50279106
Substrate
Meas. Tech.
ChEMBL_1758562 (CHEMBL4193570)
IC50
170±n/a nM
Citation
 Zidar, N?ula, AToma?i?, TRogers, MKirby, RWTytgat, JPeigneur, SKikelj, DIla?, JMa?i?, LP Clathrodin, hymenidin and oroidin, and their synthetic analogues as inhibitors of the voltage-gated potassium channels. Eur J Med Chem 139:232-241 (2017)  
Target
Name:
Potassium voltage-gated channel subfamily A member 4
Synonyms:
KCNA4 KCNA4_HUMAN Voltage-gated potassium channel subunit Kv1.4
Type:
PROTEIN
Mol. Mass.:
73234.81
Organism:
Homo sapiens (Human)
Description:
ChEMBL_471773
Residue:
653
  
Inhibitor
Name:
BDBM50279106
Synonyms:
4-(4-phenoxybutoxy)-7H-furo[3,2-g]chromen-7-one CHEMBL444449
Type:
Small organic molecule
Emp. Form.:
C21H18O5
Mol. Mass.:
350.3646
SMILES:
O=c1ccc2c(OCCCCOc3ccccc3)c3ccoc3cc2o1
: