Target
Potassium voltage-gated channel subfamily A member 4
Ligand
BDBM50220547
Substrate
Meas. Tech.
ChEMBL_1758562 (CHEMBL4193570)
IC50
2100±n/a nM
Citation
 Zidar, N?ula, AToma?i?, TRogers, MKirby, RWTytgat, JPeigneur, SKikelj, DIla?, JMa?i?, LP Clathrodin, hymenidin and oroidin, and their synthetic analogues as inhibitors of the voltage-gated potassium channels. Eur J Med Chem 139:232-241 (2017)  
Target
Name:
Potassium voltage-gated channel subfamily A member 4
Synonyms:
KCNA4 KCNA4_HUMAN Voltage-gated potassium channel subunit Kv1.4
Type:
PROTEIN
Mol. Mass.:
73234.81
Organism:
Homo sapiens (Human)
Description:
ChEMBL_471773
Residue:
653
  
Inhibitor
Name:
BDBM50220547
Synonyms:
4,5-Dibromo-1H-pyrrole-2-carboxylic acid [3-(2-amino-1H-imidazol-4-yl)-allyl]-amide CHEMBL397591 oroidin base
Type:
Small organic molecule
Emp. Form.:
C11H11Br2N5O
Mol. Mass.:
389.046
SMILES:
Nc1ncc(C=CCNC(=O)c2cc(Br)c(Br)[nH]2)[nH]1
: