Target
Sodium channel protein type 1/2/3 subunit alpha
Ligand
BDBM50021423
Substrate
Meas. Tech.
ChEMBL_202421 (CHEMBL805576)
IC50
>10000±n/a nM
Citation
 Waters, JAHollingsworth, EBDaly, JWLewandowski, GCreveling, CR Anticonvulsant activity of piperidinol and (dialkylamino)alkanol esters. J Med Chem 29:1512-6 (1986)  
Target
Name:
Sodium channel protein type 1/2/3 subunit alpha
Synonyms:
Sodium channel alpha subunits; brain (Types I, II, III) | Sodium channel protein type I I alpha subunit
Type:
Mol. Mass.:
Description:
ASSAY_ID of EBI is 68595
Components:
This complex has 3 components.
Component 1
Name:
Sodium channel protein type 1 subunit alpha
Synonyms:
NAC1 SCN1A Sodium (Site 1) Sodium channel protein type 1 subunit alpha Sodium channel protein type I subunit alpha Voltage-gated sodium channel subunit alpha Nav1.1
Type:
Protein
Mol. Mass.:
228952.47
Organism:
Homo sapiens (Human)
Description:
P35498
Residue:
2009
  
Component 2
Name:
Sodium channel protein type 2 subunit alpha
Synonyms:
HBSC II SCN2A SCN2A2 Sodium (Site 2) Sodium channel protein type 2 alpha subunit Voltage-gated sodium channel subunit alpha Nav1.2
Type:
Enzyme
Mol. Mass.:
227954.68
Organism:
Homo sapiens (Human)
Description:
Q99250
Residue:
2005
  
Component 3
Name:
Sodium channel protein type 3 subunit alpha
Synonyms:
KIAA1356 NAC3 SCN3A_HUMAN Sodium channel alpha subunits; brain (Types I, II, III) Voltage-gated sodium channel subunit alpha Nav1.3 (Nav1.3)
Type:
Protein
Mol. Mass.:
226276.42
Organism:
Homo sapiens (Human)
Description:
Q9NY46
Residue:
2000
  
Inhibitor
Name:
BDBM50021423
Synonyms:
3-Hydroxy-benzoic acid 1-methyl-piperidin-4-yl ester | CHEMBL37110
Type:
Small organic molecule
Emp. Form.:
C13H17NO3
Mol. Mass.:
235.279
SMILES:
CN1CCC(CC1)OC(=O)c1cccc(O)c1
: