Target
Xanthine dehydrogenase/oxidase
Ligand
BDBM50320491
Substrate
Meas. Tech.
ChEMBL_1758968 (CHEMBL4193976)
IC50
5.2±n/a nM
Citation
 Li, JWu, FLiu, XZou, YChen, HLi, ZZhang, L Synthesis and bioevaluation of 1-phenyl-pyrazole-4-carboxylic acid derivatives as potent xanthine oxidoreductase inhibitors. Eur J Med Chem 140:20-30 (2017)  
Target
Name:
Xanthine dehydrogenase/oxidase
Synonyms:
XDH Xanthine dehydrogenase Xanthine oxidase (XO)
Type:
Protein
Mol. Mass.:
146809.00
Organism:
Bos taurus (Bovine)
Description:
P80457
Residue:
1332
  
Inhibitor
Name:
BDBM50320491
Synonyms:
2-(3-CYANO-4-ISOBUTOXY-PHENYL)-4-METHYL-5-THIAZOLE-CARBOXYLIC ACID FEBUXOSTAT | US11744839, Compound of formula 5
Type:
Small organic molecule
Emp. Form.:
C16H16N2O3S
Mol. Mass.:
316.375
SMILES:
CC(C)COc1ccc(cc1C#N)-c1nc(C)c(s1)C(O)=O
: