Target
Serine/threonine-protein kinase B-raf
Ligand
BDBM16673
Substrate
Meas. Tech.
ChEMBL_1759725 (CHEMBL4194733)
IC50
4.4±n/a nM
Citation
 Agianian, BGavathiotis, E Current Insights of BRAF Inhibitors in Cancer. J Med Chem 61:5775-5793 (2018)  
Target
Name:
Serine/threonine-protein kinase B-raf
Synonyms:
B-RAF B-Raf proto-oncogene serine/threonine-protein kinase BRAF1 RAFB1 v-Raf murine sarcoma viral oncogene homolog B1
Type:
Serine/threonine-protein kinase
Mol. Mass.:
84446.00
Organism:
Homo sapiens (Human)
Description:
P15056
Residue:
766
  
Inhibitor
Name:
BDBM16673
Synonyms:
4-[4-({[4-chloro-3-(trifluoromethyl)phenyl]carbamoyl}amino)phenoxy]-N-methylpyridine-2-carboxamide BAY 43-9006 BAY439006 Hit compound, 8 Sorafenib US10183928, Sorafenib US10227329, Compound Sorafenib US10774070, Compound Sorafenib US11279688, Compound Sorafenib US9029401, Sorafenib US9902709, Comparative example 1 cid_216239
Type:
Small organic molecule
Emp. Form.:
C21H16ClF3N4O3
Mol. Mass.:
464.825
SMILES:
CNC(=O)c1cc(Oc2ccc(NC(=O)Nc3ccc(Cl)c(c3)C(F)(F)F)cc2)ccn1
: