Target
5-hydroxytryptamine receptor 7
Ligand
BDBM152784
Substrate
Meas. Tech.
ChEMBL_1760123 (CHEMBL4195131)
Ki
157±n/a nM
Citation
 Pa?czyk, KPytka, KJakubczyk, MRapacz, ASa?at, KFurga?a, ASiwek, AG?uch-Lutwin, MGrybo?, AS?oczy?ska, KP?kala, E?mudzki, PBucki, AKo?aczkowski, M?elaszczyk, DMarona, HWaszkielewicz, AM Synthesis and activity of di- or trisubstituted N-(phenoxyalkyl)- or N-{2-[2-(phenoxy)ethoxy]ethyl}piperazine derivatives on the central nervous system. Bioorg Med Chem Lett 28:2039-2049 (2018)  
Target
Name:
5-hydroxytryptamine receptor 7
Synonyms:
5-HT-7 5-HT7 5-HT7S 5HT7 HTR7 | Serotonin receptor 7
Type:
G Protein-Coupled Receptor (GPCR)
Mol. Mass.:
53573.08
Organism:
Homo sapiens (Human)
Description:
P34969
Residue:
479
  
Inhibitor
Name:
BDBM152784
Synonyms:
1-[(2,4,6-trimethylphenoxy)propyl]-4-(2-methoxyphenyl)piperazine hydrochloride (4) | CHEMBL4218586
Type:
Small organic molecule
Emp. Form.:
C23H32N2O2
Mol. Mass.:
368.5124
SMILES:
COc1ccccc1N1CCN(CCCOc2c(C)cc(C)cc2C)CC1
: