Target
5-hydroxytryptamine receptor 2A
Ligand
BDBM152785
Substrate
Meas. Tech.
ChEMBL_1760120 (CHEMBL4195128)
Ki
264±n/a nM
Citation
 Pa?czyk, KPytka, KJakubczyk, MRapacz, ASa?at, KFurga?a, ASiwek, AG?uch-Lutwin, MGrybo?, AS?oczy?ska, KP?kala, E?mudzki, PBucki, AKo?aczkowski, M?elaszczyk, DMarona, HWaszkielewicz, AM Synthesis and activity of di- or trisubstituted N-(phenoxyalkyl)- or N-{2-[2-(phenoxy)ethoxy]ethyl}piperazine derivatives on the central nervous system. Bioorg Med Chem Lett 28:2039-2049 (2018)  
Target
Name:
5-hydroxytryptamine receptor 2A
Synonyms:
5-HT-2 5-HT2A 5-hydroxytryptamine receptor 2A (5HT-2A) 5HT2A_HUMAN HTR2A | Serotonin receptor 2A
Type:
undefined
Mol. Mass.:
52607.65
Organism:
Homo sapiens (Human)
Description:
P28223
Residue:
471
  
Inhibitor
Name:
BDBM152785
Synonyms:
1-[(2,6-dimethylphenoxy)ethoxyethyl]-4-(2-methoxyphenyl)piperazine hydrochloride (5) | CHEMBL4213647
Type:
Small organic molecule
Emp. Form.:
C23H32N2O3
Mol. Mass.:
384.5118
SMILES:
COc1ccccc1N1CCN(CCOCCOc2c(C)cccc2C)CC1
: